Reaction Details
TargetFibroblast growth factor receptor 3
LigandBDBM339836
Substrate/Competitorn/a
Meas. Tech.FGFR3 (Enzymatic Assay)
IC50 2.09±n/a nM
Citation Angibaud, PRObringer, MMarin, JJJeanty, M Naphthyridine derivative compounds US Patent US9757364 Publication Date 9/12/2017
 
Fibroblast growth factor receptor 3
Name:Fibroblast growth factor receptor 3
Type:Protein
Mol. Mass.:87699.57
Organism:Homo sapiens (Human)
Description:P22607
Residue:806
BDBM339836
NameBDBM339836
Synonyms:US9757364, Compound 34
TypeSmall organic molecule
Emp. Form.C24H21Cl2N7O2
Mol. Mass.510.375
SMILESCOc1cc(OC)c(Cl)c(N(Cc2ncc[nH]2)c2ccc3ncc(cc3n2)-c2cnn(C)c2)c1Cl