Reaction Details
TargetFibroblast growth factor receptor 2
LigandBDBM339838
Substrate/Competitorn/a
Meas. Tech.FGFR2 (Enzymatic Assay)
IC50 0.603±n/a nM
Citation Angibaud, PRObringer, MMarin, JJJeanty, M Naphthyridine derivative compounds US Patent US9757364 Publication Date 9/12/2017
 
Fibroblast growth factor receptor 2
Name:Fibroblast growth factor receptor 2
Type:Enzyme
Mol. Mass.:92015.45
Organism:Homo sapiens (Human)
Description:P21802
Residue:821
BDBM339838
NameBDBM339838
Synonyms:US9757364, Compound 39
TypeSmall organic molecule
Emp. Form.C24H23N7O2
Mol. Mass.441.4851
SMILESCOc1cc(OC)cc(c1)N(Cc1c[nH]cn1)c1ccc2ncc(cc2n1)-c1cnn(C)c1