Reaction Details
TargetFibroblast growth factor receptor 1
LigandBDBM339840
Substrate/Competitorn/a
Meas. Tech.FGFR1 (Enzymatic Assay)
IC50 2.34±n/a nM
Citation Angibaud, PRObringer, MMarin, JJJeanty, M Naphthyridine derivative compounds US Patent US9757364 Publication Date 9/12/2017
 
Fibroblast growth factor receptor 1
Name:Fibroblast growth factor receptor 1
Type:Receptor
Mol. Mass.:91861.70
Organism:Homo sapiens (Human)
Description:P11362
Residue:822
BDBM339840
NameBDBM339840
Synonyms:US9757364, Compound 37 | US9757364, Compound 41
TypeSmall organic molecule
Emp. Form.C25H26N6O3
Mol. Mass.458.5123
SMILESCOc1cc(OC)cc(c1)N(CC1CCC(=O)N1)c1ccc2ncc(cc2n1)-c1cnn(C)c1