Reaction Details
TargetFibroblast growth factor receptor 4
LigandBDBM339847
Substrate/Competitorn/a
Meas. Tech.FGFR4 (Enzymatic Assay)
IC50 2.24±n/a nM
Citation Angibaud, PRObringer, MMarin, JJJeanty, M Naphthyridine derivative compounds US Patent US9757364 Publication Date 9/12/2017
 
Fibroblast growth factor receptor 4
Name:Fibroblast growth factor receptor 4
Type:Protein
Mol. Mass.:87957.45
Organism:Homo sapiens (Human)
Description:P22455
Residue:802
BDBM339847
NameBDBM339847
Synonyms:US9757364, Compound 45
TypeSmall organic molecule
Emp. Form.C25H25F2N5O3
Mol. Mass.481.4945
SMILESCOc1cc(OC)c(F)c(N(CC2CCCO2)c2ccc3ncc(cc3n2)-c2cnn(C)c2)c1F