Reaction Details
TargetFibroblast growth factor receptor 1
LigandBDBM339848
Substrate/Competitorn/a
Meas. Tech.FGFR1 (Enzymatic Assay)
IC50 1.45±n/a nM
Citation Angibaud, PRObringer, MMarin, JJJeanty, M Naphthyridine derivative compounds US Patent US9757364 Publication Date 9/12/2017
 
Fibroblast growth factor receptor 1
Name:Fibroblast growth factor receptor 1
Type:Receptor
Mol. Mass.:91861.70
Organism:Homo sapiens (Human)
Description:P11362
Residue:822
BDBM339848
NameBDBM339848
Synonyms:US9757364, Compound 47
TypeSmall organic molecule
Emp. Form.C23H22N8O2
Mol. Mass.442.4732
SMILESCOc1cc(OC)cc(c1)N(Cc1nnc[nH]1)c1ccc2ncc(cc2n1)-c1cnn(C)c1