Reaction Details
TargetFibroblast growth factor receptor 2
LigandBDBM339871
Substrate/Competitorn/a
Meas. Tech.FGFR2 (Enzymatic Assay)
IC50 1.41±n/a nM
Citation Angibaud, PRObringer, MMarin, JJJeanty, M Naphthyridine derivative compounds US Patent US9757364 Publication Date 9/12/2017
 
Fibroblast growth factor receptor 2
Name:Fibroblast growth factor receptor 2
Type:Enzyme
Mol. Mass.:92015.45
Organism:Homo sapiens (Human)
Description:P21802
Residue:821
BDBM339871
NameBDBM339871
Synonyms:US9757364, Compound 55
TypeSmall organic molecule
Emp. Form.C24H22FN7O2
Mol. Mass.459.4756
SMILESCOc1cc(OC)c(F)c(c1)N(Cc1cc[nH]n1)c1ccc2ncc(cc2n1)-c1cnn(C)c1