Reaction Details
TargetMuscarinic acetylcholine receptor M3
LigandBDBM200742
Substrate/Competitorn/a
Meas. Tech.Receptors Binding Assay
IC50 0.400±n/a nM
Citation Aiguade Bosch, JGual Roig, SPrat Quinones, MPuig Duran, C Cyclohexylamine derivatives having β2 adrenergic agonist and M3 muscarinic antagonist activities US Patent US9757383 Publication Date 9/12/2017
 
Muscarinic acetylcholine receptor M3
Name:Muscarinic acetylcholine receptor M3
Type:Enzyme
Mol. Mass.:66151.03
Organism:Homo sapiens (Human)
Description:P20309
Residue:590
BDBM200742
NameBDBM200742
Synonyms:US9233108, 2 | US9757383, Example 2
TypeSmall organic molecule
Emp. Form.C39H43N5O7S2
Mol. Mass.757.918
SMILESCN(CCCn1c2ccc(CNC[C@H](O)c3ccc(O)c4[nH]c(=O)ccc34)cc2[nH]c1=O)[C@H]1CC[C@@H](CC1)OC(=O)C(O)(c1cccs1)c1cccs1