Reaction Details
TargetMuscarinic acetylcholine receptor M3
LigandBDBM200747
Substrate/Competitorn/a
Meas. Tech.Receptors Binding Assay
IC50 0.200±n/a nM
Citation Aiguade Bosch, JGual Roig, SPrat Quinones, MPuig Duran, C Cyclohexylamine derivatives having β2 adrenergic agonist and M3 muscarinic antagonist activities US Patent US9757383 Publication Date 9/12/2017
 
Muscarinic acetylcholine receptor M3
Name:Muscarinic acetylcholine receptor M3
Type:Enzyme
Mol. Mass.:66151.03
Organism:Homo sapiens (Human)
Description:P20309
Residue:590
BDBM200747
NameBDBM200747
Synonyms:US9233108, 9 | US9757383, Example 9
TypeSmall organic molecule
Emp. Form.C41H44ClN5O8S2
Mol. Mass.834.4
SMILESCOc1cc(-c2noc(CCCN(C)[C@H]3CC[C@@H](CC3)OC(=O)C(O)(c3cccs3)c3cccs3)n2)c(Cl)cc1CNC[C@H](O)c1ccc(O)c2[nH]c(=O)ccc12