Reaction Details
TargetCoagulation factor X
LigandBDBM14059
Substrate/CompetitorBDBM12593
Meas. Tech.Enzyme Assay and Determination of the Inhibition Constants.
pH7.5±n/a
Temperature295.15±n/a K
Ki 0.7±n/a nM
Citation Maignan, SGuilloteau, JPPouzieux, SChoi-Sledeski, YMBecker, MRKlein, SIEwing, WRPauls, HWSpada, APMikol, V Crystal structures of human factor Xa complexed with potent inhibitors. J Med Chem43:3226-32 (2000) 
 
Coagulation factor X
Name:Coagulation factor X
Type:Enzyme
Mol. Mass.:54726.60
Organism:Homo sapiens (Human)
Description:n/a
Residue:488
BDBM14059
BDBM12593
NameBDBM14059
Synonyms:4-hydroxy-3-[[(3S)-2-oxo-3-(9-thia-5-azabicyclo[4.3.0]nona-2,4,7,10-tetraen-8-ylsulfonylamino)pyrrolidin-1-yl]methyl]benzenecarboximidamide CHEMBL330572 | RPR131247
TypeSmall organic molecule
Emp. Form.C19H19N5O4S2
Mol. Mass.445.515
SMILESNC(=N)c1ccc(O)c(CN2CC[C@H](NS(=O)(=O)c3cc4ncccc4s3)C2=O)c1