Reaction Details
TargetAlpha-2A adrenergic receptor [16-465]
LigandBDBM14060
Substrate/CompetitorBDBM14062
Meas. Tech.alpha-Adrenoceptor Radioligand Binding Assay
pH7.7±n/a
Temperature298.15±n/a K
Ki 220±40 nM
Citation McMillan, FMArchbold, JMcLeish, MJCaine, JMCriscione, KRGrunewald, GLMartin, JL Molecular recognition of sub-micromolar inhibitors by the epinephrine-synthesizing enzyme phenylethanolamine N-methyltransferase. J Med Chem47:37-44 (2004) 
 
Alpha-2A adrenergic receptor [16-465]
Name:Alpha-2A adrenergic receptor [16-465]
Type:G-protein coupled receptor
Mol. Mass.:48961.69
Organism:Rattus norvegicus (rat)
Description:P22909[16-465]
Residue:450
BDBM14060
BDBM14062
NameBDBM14060
Synonyms:7-Iodo-1,2,3,4-tetrahydroisoquinoline tetrahydroisoquinoline (THIQ) deriv. 2
TypeSmall organic molecule
Emp. Form.C9H10IN
Mol. Mass.259.0869
SMILESIc1ccc2CCNCc2c1