Reaction Details
TargetProthrombin
LigandBDBM14072
Substrate/CompetitorBDBM14064
Meas. Tech.Enzyme Inhibition Assay
pH7.4±n/a
Temperature310.15±n/a K
Ki 0.36±0.09 nM
IC50 29±13 nM
Citation Costanzo, MJAlmond, HRHecker, LRSchott, MRYabut, SCZhang, HCAndrade-Gordon, PCorcoran, TWGiardino, ECKauffman, JALewis, JMde Garavilla, LHaertlein, BJMaryanoff, BE In-depth study of tripeptide-based alpha-ketoheterocycles as inhibitors of thrombin. Effective utilization of the S1' subsite and its implications to structure-based drug design. J Med Chem48:1984-2008 (2005) 
 
Prothrombin
Name:Prothrombin
Type:Protein
Mol. Mass.:70029.57
Organism:Homo sapiens (Human)
Description:P00734
Residue:622
BDBM14072
BDBM14064
NameBDBM14072
Synonyms:2-ketobenzothiazole 12 | 2-{[(2R)-1-[(2S)-2-{[1-(1,3-benzothiazol-2-yl)-5-carbamimidamido-1-oxopentan-2-yl]carbamoyl}pyrrolidin-1-yl]-3-cyclohexyl-1-oxopropan-2-yl]amino}acetic acid
TypeSmall organic molecule
Emp. Form.C29H41N7O5S
Mol. Mass.599.745
SMILES[#7]\[#6](-[#7])=[#7]\[#6]-[#6]-[#6]-[#6](-[#7]-[#6](=O)-[#6@@H]-1-[#6]-[#6]-[#6]-[#7]-1-[#6](=O)-[#6@@H](-[#6]-[#6]-1-[#6]-[#6]-[#6]-[#6]-[#6]-1)-[#7]-[#6]-[#6](-[#8])=O)-[#6](=O)-c1nc2ccccc2s1