Reaction Details
TargetP2X purinoceptor 7
LigandBDBM174777
Substrate/Competitorn/a
Meas. Tech.Ca2+ Flux Assay
pH7.4±n/a
Ki 1.30±n/a nM
IC50 9.70±n/a nM
Commentsextracted
Citation Letavic, MARudolph, DA P2X7 modulators US Patent US9540388 Publication Date 1/10/2017
 
P2X purinoceptor 7
Name:P2X purinoceptor 7
Type:Protein
Mol. Mass.:68602.85
Organism:Homo sapiens (Human)
Description:Q99572
Residue:595
BDBM174777
NameBDBM174777
Synonyms:US10053462, 8 US9540388, 8
TypeSmall organic molecule
Emp. Form.C19H15ClF3N5OS
Mol. Mass.453.869
SMILESFC(F)(F)c1cccc(C(=O)N2[C@H]3CCC[C@@H]2c2nnc(-c4cscn4)n2C3)c1Cl