Reaction Details
TargetE3 ubiquitin-protein ligase Mdm2 [1-188]
LigandBDBM339934
Substrate/Competitorn/a
Meas. Tech.Homogenous Time-Resolved Fluorescence Assay
IC50<0.100±n/a nM
Citation Gonzalez Buenrostro, ALi, YMedina, JCOlson, SH Heteroaryl acid morpholinone compounds as MDM2 inhibitors for the treatment of cancer US Patent US9758495 Publication Date 9/12/2017
 
E3 ubiquitin-protein ligase Mdm2 [1-188]
Name:E3 ubiquitin-protein ligase Mdm2 [1-188]
Type:n/a
Mol. Mass.:21319.18
Organism:Homo sapiens (Human)
Description:Q00987[1-188]
Residue:188
BDBM339934
NameBDBM339934
Synonyms:US9758495, 7
TypeSmall organic molecule
Emp. Form.C33H35Cl2FN2O6S
Mol. Mass.677.61
SMILESCC(C)(C)S(=O)(=O)C[C@H](C1CC1)N1[C@@H]([C@H](O[C@](C)(Cc2ccc(cn2)C(O)=O)C1=O)c1cccc(Cl)c1)c1ccc(Cl)c(F)c1