Reaction Details
TargetTryptophan 2,3-dioxygenase
LigandBDBM339928
Substrate/Competitorn/a
Meas. Tech.Enzymatic Activity Assay
IC50 370±n/a nM
Citation Crosignani, SCauwenberghs, SDriessens, GDeroose, F 3-(indol-3-yl)-pyridine derivatives, pharmaceutical compositions and methods for use US Patent US9758505 Publication Date 9/12/2017
 
Tryptophan 2,3-dioxygenase
Name:Tryptophan 2,3-dioxygenase
Type:PROTEIN
Mol. Mass.:47874.48
Organism:Homo sapiens (Human)
Description:ChEMBL_825691
Residue:406
BDBM339928
NameBDBM339928
Synonyms:6-fluoro-3-(6-methylpyridin-3- yl)-1H-indole | US9758505, 1
TypeSmall organic molecule
Emp. Form.C14H11FN2
Mol. Mass.226.2489
SMILESCc1ccc(cn1)-c1c[nH]c2cc(F)ccc12