Reaction Details
TargetTryptophan 2,3-dioxygenase
LigandBDBM339929
Substrate/Competitorn/a
Meas. Tech.Enzymatic Activity Assay
IC50 560±n/a nM
Citation Crosignani, SCauwenberghs, SDriessens, GDeroose, F 3-(indol-3-yl)-pyridine derivatives, pharmaceutical compositions and methods for use US Patent US9758505 Publication Date 9/12/2017
 
Tryptophan 2,3-dioxygenase
Name:Tryptophan 2,3-dioxygenase
Type:PROTEIN
Mol. Mass.:47874.48
Organism:Homo sapiens (Human)
Description:ChEMBL_825691
Residue:406
BDBM339929
NameBDBM339929
Synonyms:6-fluoro-3-(6-(piperidin-4- yloxy)pyridin-3-yl)-1H-indole | US9758505, 2
TypeSmall organic molecule
Emp. Form.C18H18FN3O
Mol. Mass.311.3534
SMILESFc1ccc2c(c[nH]c2c1)-c1ccc(OC2CCNCC2)nc1