Reaction Details
TargetTryptophan 2,3-dioxygenase
LigandBDBM339957
Substrate/Competitorn/a
Meas. Tech.Enzymatic Activity Assay
IC50 490±n/a nM
Citation Crosignani, SCauwenberghs, SDriessens, GDeroose, F 3-(indol-3-yl)-pyridine derivatives, pharmaceutical compositions and methods for use US Patent US9758505 Publication Date 9/12/2017
 
Tryptophan 2,3-dioxygenase
Name:Tryptophan 2,3-dioxygenase
Type:PROTEIN
Mol. Mass.:47874.48
Organism:Homo sapiens (Human)
Description:ChEMBL_825691
Residue:406
BDBM339957
NameBDBM339957
Synonyms:2-((5-(6-fluoro-1H-indol-3- yl)pyridin-2-yl)amino)ethanol | US9758505, 27
TypeSmall organic molecule
Emp. Form.C15H14FN3O
Mol. Mass.271.2896
SMILESOCCNc1ccc(cn1)-c1c[nH]c2cc(F)ccc12