Reaction Details
TargetTryptophan 2,3-dioxygenase
LigandBDBM339961
Substrate/Competitorn/a
Meas. Tech.Enzymatic Activity Assay
IC50 290±n/a nM
Citation Crosignani, SCauwenberghs, SDriessens, GDeroose, F 3-(indol-3-yl)-pyridine derivatives, pharmaceutical compositions and methods for use US Patent US9758505 Publication Date 9/12/2017
 
Tryptophan 2,3-dioxygenase
Name:Tryptophan 2,3-dioxygenase
Type:PROTEIN
Mol. Mass.:47874.48
Organism:Homo sapiens (Human)
Description:ChEMBL_825691
Residue:406
BDBM339961
NameBDBM339961
Synonyms:5-(6-fluoro-1H-indol-3-yl)-N- methylpyridin-2-amine | US9758505, 34
TypeSmall organic molecule
Emp. Form.C14H12FN3
Mol. Mass.241.2636
SMILESCNc1ccc(cn1)-c1c[nH]c2cc(F)ccc12