Reaction Details
TargetPhosphatidylinositol 3-kinase regulatory subunit alpha
LigandBDBM340319
Substrate/Competitorn/a
Meas. Tech.Biochemical Assay
Ki<0.018±n/a nM
Citation Chen, PCheng, HGallego, GMJalaie, MKath, JCOrr, STPairish, MA Pyrimidine derivatives US Patent US9758538 Publication Date 9/12/2017
 
Phosphatidylinositol 3-kinase regulatory subunit alpha
Name:Phosphatidylinositol 3-kinase regulatory subunit alpha
Type:Protein
Mol. Mass.:83592.82
Organism:Homo sapiens (Human)
Description:P27986
Residue:724
BDBM340319
NameBDBM340319
Synonyms:US9758538, Example 7 US9758538, Example 9
TypeSmall organic molecule
Emp. Form.C22H31N7O5
Mol. Mass.473.5254
SMILESCC(C)(C)OC(=O)N1CCC(CO)(C1)Oc1cc(nc(n1)N1CCOCC1)-c1cnc(N)nc1