Reaction Details
TargetPhosphatidylinositol 3-kinase regulatory subunit alpha
LigandBDBM340337
Substrate/Competitorn/a
Meas. Tech.Biochemical Assay
Ki 0.717±n/a nM
Citation Chen, PCheng, HGallego, GMJalaie, MKath, JCOrr, STPairish, MA Pyrimidine derivatives US Patent US9758538 Publication Date 9/12/2017
 
Phosphatidylinositol 3-kinase regulatory subunit alpha
Name:Phosphatidylinositol 3-kinase regulatory subunit alpha
Type:Protein
Mol. Mass.:83592.82
Organism:Homo sapiens (Human)
Description:P27986
Residue:724
BDBM340337
NameBDBM340337
Synonyms:US9758538, Example 25 US9758538, Example 27
TypeSmall organic molecule
Emp. Form.C23H34N8O4
Mol. Mass.486.5673
SMILESCN(c1cc(nc(n1)N1CCOCC1)-c1cnc(N)nc1)C1(CO)CCN(C1)C(=O)OC(C)(C)C