Reaction Details
TargetPhosphatidylinositol 3-kinase regulatory subunit alpha
LigandBDBM340346
Substrate/Competitorn/a
Meas. Tech.Biochemical Assay
Ki 0.019±n/a nM
Citation Chen, PCheng, HGallego, GMJalaie, MKath, JCOrr, STPairish, MA Pyrimidine derivatives US Patent US9758538 Publication Date 9/12/2017
 
Phosphatidylinositol 3-kinase regulatory subunit alpha
Name:Phosphatidylinositol 3-kinase regulatory subunit alpha
Type:Protein
Mol. Mass.:83592.82
Organism:Homo sapiens (Human)
Description:P27986
Residue:724
BDBM340346
NameBDBM340346
Synonyms:US9758538, Example 34
TypeSmall organic molecule
Emp. Form.C19H26N8O4
Mol. Mass.430.4609
SMILESCOC(=O)N1CC[C@@](CO)(C1)Nc1cc(nc(n1)N1CCOCC1)-c1cnc(N)nc1