Reaction Details
TargetPhosphatidylinositol 3-kinase regulatory subunit alpha
LigandBDBM340401
Substrate/Competitorn/a
Meas. Tech.Biochemical Assay
Ki<0.018±n/a nM
Citation Chen, PCheng, HGallego, GMJalaie, MKath, JCOrr, STPairish, MA Pyrimidine derivatives US Patent US9758538 Publication Date 9/12/2017
 
Phosphatidylinositol 3-kinase regulatory subunit alpha
Name:Phosphatidylinositol 3-kinase regulatory subunit alpha
Type:Protein
Mol. Mass.:83592.82
Organism:Homo sapiens (Human)
Description:P27986
Residue:724
BDBM340401
NameBDBM340401
Synonyms:US9758538, Example 89
TypeSmall organic molecule
Emp. Form.C21H29N9O3
Mol. Mass.455.5135
SMILESNc1ncc(cn1)-c1cc(N[C@@]2(CO)CCN(C2)C(=O)N2CCC2)nc(n1)N1CCOCC1