Reaction Details
TargetCalmodulin-domain protein kinase 1
LigandBDBM50345725
Substrate/Competitorn/a
Meas. Tech.Biological Assay
IC50 4.00±n/a nM
Citation Van Voorhis, WCHol, WGLarson, ETMaly, DJMerritt, EOjo, KK Compositions and methods for treating toxoplasmosis, cryptosporidiosis, and other apicomplexan protozoan related diseases US Patent US9765037 Publication Date 9/19/2017
 
Calmodulin-domain protein kinase 1
Name:Calmodulin-domain protein kinase 1
Type:Enzyme Catalytic Domain
Mol. Mass.:57248.42
Organism:Toxoplasma gondii
Description:n/a
Residue:507
BDBM50345725
NameBDBM50345725
Synonyms:3-(3,4-dichlorophenyl)-1-isopropyl-1H-pyrazolo[3,4-d]pyrimidin-4-amine US10544104, Compound 7c US9765037, Compound 7c
TypeSmall organic molecule
Emp. Form.C14H13Cl2N5
Mol. Mass.322.193
SMILESCC(C)n1nc(-c2ccc(Cl)c(Cl)c2)c2c(N)ncnc12