Reaction Details
TargetTyrosine-protein kinase ABL1
LigandBDBM50298225
Substrate/Competitorn/a
Meas. Tech.Inhibition Assay
IC50 7700±n/a nM
Citation Van Voorhis, WCHol, WGLarson, ETMaly, DJMerritt, EOjo, KK Compositions and methods for treating toxoplasmosis, cryptosporidiosis, and other apicomplexan protozoan related diseases US Patent US9765037 Publication Date 9/19/2017
 
Tyrosine-protein kinase ABL1
Name:Tyrosine-protein kinase ABL1
Type:Enzyme
Mol. Mass.:122897.30
Organism:Homo sapiens (Human)
Description:P00519
Residue:1130
BDBM50298225
NameBDBM50298225
Synonyms:CHEMBL2069955 NM-PP1 US11247972, Compound 5d | US9765037, Compound 5d
TypeSmall organic molecule
Emp. Form.C20H21N5
Mol. Mass.331.4142
SMILESCC(C)(C)n1nc(Cc2cccc3ccccc23)c2c(N)ncnc12