Reaction Details
TargetProto-oncogene tyrosine-protein kinase Src
LigandBDBM50389687
Substrate/Competitorn/a
Meas. Tech.Inhibition Assay
IC50 199±n/a nM
Citation Van Voorhis, WCHol, WGLarson, ETMaly, DJMerritt, EOjo, KK Compositions and methods for treating toxoplasmosis, cryptosporidiosis, and other apicomplexan protozoan related diseases US Patent US9765037 Publication Date 9/19/2017
 
Proto-oncogene tyrosine-protein kinase Src
Name:Proto-oncogene tyrosine-protein kinase Src
Type:Protein
Mol. Mass.:59838.60
Organism:Homo sapiens (Human)
Description:P12931
Residue:536
BDBM50389687
NameBDBM50389687
Synonyms:CHEMBL2070054 US11247972, Compound 41 | US9765037, Compound 41
TypeSmall organic molecule
Emp. Form.C21H21N5O
Mol. Mass.359.4243
SMILESCC(C)n1nc(-c2ccc3cc(OCC=C)ccc3c2)c2c(N)ncnc12