Reaction Details
TargetTyrosine-protein phosphatase non-receptor type 1 [1-298]
LigandBDBM14250
Substrate/CompetitorBDBM13466
Meas. Tech.Enzymatic Assay
pH7±n/a
Temperature295.15±n/a K
Ki 300±n/a nM
Citation Wan, ZKLee, JXu, WErbe, DVJoseph-McCarthy, DFollows, BCZhang, YL Monocyclic thiophenes as protein tyrosine phosphatase 1B inhibitors: capturing interactions with Asp48. Bioorg Med Chem Lett16:4941-5 (2006) 
 
Tyrosine-protein phosphatase non-receptor type 1 [1-298]
Name:Tyrosine-protein phosphatase non-receptor type 1 [1-298]
Type:Enzyme
Mol. Mass.:34670.65
Organism:Homo sapiens (Human)
Description:The catalytic domain of PTP 1B (residues 1-298) was expressed and purified from E. coli.
Residue:298
BDBM14250
BDBM13466
NameBDBM14250
Synonyms:4-bromo-3-(carboxymethoxy)-5-(4-hydroxyphenyl)thiophene-2-carboxylic acid | Monocyclic thiophene analog 17
TypeSmall organic molecule
Emp. Form.C13H9BrO6S
Mol. Mass.373.176
SMILESOC(=O)COc1c(Br)c(sc1C(O)=O)-c1ccc(O)cc1