Reaction Details
TargetTyrosine-protein phosphatase non-receptor type 1 [1-298]
LigandBDBM14267
Substrate/CompetitorBDBM13466
Meas. Tech.Enzymatic Assay
Temperature298.15±n/a K
Ki 140±n/a nM
Commentsextracted
Citation Wan, ZKLee, JXu, WErbe, DVJoseph-McCarthy, DFollows, BCZhang, YL Monocyclic thiophenes as protein tyrosine phosphatase 1B inhibitors: capturing interactions with Asp48. Bioorg Med Chem Lett16:4941-5 (2006) 
 
Tyrosine-protein phosphatase non-receptor type 1 [1-298]
Name:Tyrosine-protein phosphatase non-receptor type 1 [1-298]
Type:Enzyme
Mol. Mass.:34670.65
Organism:Homo sapiens (Human)
Description:The catalytic domain of PTP 1B (residues 1-298) was expressed and purified from E. coli.
Residue:298
BDBM14267
BDBM13466
NameBDBM14267
Synonyms:4-bromo-3-(carboxymethoxy)-5-[4-(2-formamidoacetic acid)phenyl]thiophene-2-carboxylic acid | Monocyclic thiophene analog 36
TypeSmall organic molecule
Emp. Form.C16H12BrNO8S
Mol. Mass.458.237
SMILESOC(=O)COc1c(Br)c(sc1C(O)=O)-c1ccc(NC(=O)CC(O)=O)cc1