Reaction Details
TargetLarge neutral amino acids transporter small subunit 1
LigandBDBM340646
Substrate/Competitorn/a
Meas. Tech.Inhibitory Activity Assay
IC50 261000±n/a nM
Citation Kanai, YNagamori, SKitaura, YNeya, MMatsushita, N Phenoxyalkylamine compound US Patent US9771316 Publication Date 9/26/2017
 
Large neutral amino acids transporter small subunit 1
Name:Large neutral amino acids transporter small subunit 1
Type:PROTEIN
Mol. Mass.:55013.61
Organism:Homo sapiens (Human)
Description:ChEMBL_100160
Residue:507
BDBM340646
NameBDBM340646
Synonyms:US9771316, Example 51
TypeSmall organic molecule
Emp. Form.C19H27NOS
Mol. Mass.317.489
SMILESCCC(C)c1ccc(OC(CCCCN)c2cccs2)cc1