Reaction Details
TargetMitogen-activated protein kinase 12
LigandBDBM342101
Substrate/Competitorn/a
Meas. Tech.Enzyme Inhibition
IC50 5.00±n/a nM
Citation Fyfe, MC Kinase inhibitors based upon N-alkyl pyrazoles US Patent US9771353 Publication Date 9/26/2017
 
Mitogen-activated protein kinase 12
Name:Mitogen-activated protein kinase 12
Type:Protein
Mol. Mass.:41938.69
Organism:Homo sapiens (Human)
Description:P53778
Residue:367
BDBM342101
NameBDBM342101
Synonyms:3-((4-((4-(3-(3-(tert-Butyl)-1-methyl-1H-pyrazol-5-yl)ureido)naphthalen-1-yl)oxy)pyrimidin-2-yl)amino)-5-ethynyl-N-(2-morpholinoethyl)benzamide | US9771353, Example 1
TypeSmall organic molecule
Emp. Form.C38H41N9O4
Mol. Mass.687.79
SMILESCn1nc(cc1NC(=O)Nc1ccc(Oc2ccnc(Nc3cc(cc(c3)C(=O)NCCN3CCOCC3)C#C)n2)c2ccccc12)C(C)(C)C