Reaction Details
TargetMitogen-activated protein kinase 12
LigandBDBM342108
Substrate/Competitorn/a
Meas. Tech.Enzyme Inhibition
IC50 20.0±n/a nM
Citation Fyfe, MC Kinase inhibitors based upon N-alkyl pyrazoles US Patent US9771353 Publication Date 9/26/2017
 
Mitogen-activated protein kinase 12
Name:Mitogen-activated protein kinase 12
Type:Protein
Mol. Mass.:41938.69
Organism:Homo sapiens (Human)
Description:P53778
Residue:367
BDBM342108
NameBDBM342108
Synonyms:3-((4-((4-(3-(3-(tert-Butyl)-1-ethyl-1H-pyrazol-5-yl)ureido)naphthalen-1-yl)oxy)pyrimidin-2-yl)amino)-5-ethynyl-N-(2-(2-(2-methoxyethoxy)ethoxy)ethyl)benzamide | US9771353, Example 8
TypeSmall organic molecule
Emp. Form.C40H46N8O6
Mol. Mass.734.8432
SMILESCCn1nc(cc1NC(=O)Nc1ccc(Oc2ccnc(Nc3cc(cc(c3)C(=O)NCCOCCOCCOC)C#C)n2)c2ccccc12)C(C)(C)C