Reaction Details
TargetMitogen-activated protein kinase 12
LigandBDBM342110
Substrate/Competitorn/a
Meas. Tech.Enzyme Inhibition
IC50 9.00±n/a nM
Citation Fyfe, MC Kinase inhibitors based upon N-alkyl pyrazoles US Patent US9771353 Publication Date 9/26/2017
 
Mitogen-activated protein kinase 12
Name:Mitogen-activated protein kinase 12
Type:Protein
Mol. Mass.:41938.69
Organism:Homo sapiens (Human)
Description:P53778
Residue:367
BDBM342110
NameBDBM342110
Synonyms:3-Ethynyl-5-((4-((4-(3-(3-isopropyl-1-methyl-1H-pyrazol-5-yl)ureido)naphthalen-1-yl)oxy)pyrimidin-2-yl)amino)-N-(2-morpholinoethyl)benzamide | US9771353, Example 10
TypeSmall organic molecule
Emp. Form.C37H39N9O4
Mol. Mass.673.7635
SMILESCC(C)c1cc(NC(=O)Nc2ccc(Oc3ccnc(Nc4cc(cc(c4)C(=O)NCCN4CCOCC4)C#C)n3)c3ccccc23)n(C)n1