Reaction Details
TargetcAMP-specific 3',5'-cyclic phosphodiesterase 4A
LigandBDBM14381
Substrate/CompetitorBDBM10851
Meas. Tech.PDE Activity Assay
pH8±n/a
Temperature295.15±n/a K
Ki 103±13 nM
Citation Whitehead, JWLee, GPGharagozloo, PHofer, PGehrig, AWintergerst, PSmyth, DMcCoull, WHachicha, MPatel, AKyle, DJ 8-Substituted analogues of 3-(3-cyclopentyloxy-4-methoxy-benzyl)-8-isopropyladenine: highly potent and selective PDE4 inhibitors. J Med Chem48:1237-43 (2005) 
 
cAMP-specific 3',5'-cyclic phosphodiesterase 4A
Name:cAMP-specific 3',5'-cyclic phosphodiesterase 4A
Type:Enzyme
Mol. Mass.:98113.27
Organism:Homo sapiens (Human)
Description:P27815
Residue:886
BDBM14381
BDBM10851
NameBDBM14381
Synonyms:4-{2-[6-Amino-3-(3-cyclopentyloxy-4-methoxy-benzyl)-3H-purin-8-yl]-2-methyl-propoxy}-benzoic Acid Methyl Ester | V11294 Analogue 5q
TypeSmall organic molecule
Emp. Form.C30H35N5O5
Mol. Mass.545.6294
SMILESCOC(=O)c1ccc(COC(C)(C)c2nc3c(N)ncn(Cc4ccc(OC)c(OC5CCCC5)c4)c3n2)cc1