Reaction Details
TargetcAMP-specific 3',5'-cyclic phosphodiesterase 4B
LigandBDBM14366
Substrate/CompetitorBDBM10851
Meas. Tech.PDE Activity Assay
Ki 11.0±n/a nM
Citation Whitehead, JWLee, GPGharagozloo, PHofer, PGehrig, AWintergerst, PSmyth, DMcCoull, WHachicha, MPatel, AKyle, DJ 8-Substituted analogues of 3-(3-cyclopentyloxy-4-methoxy-benzyl)-8-isopropyladenine: highly potent and selective PDE4 inhibitors. J Med Chem48:1237-43 (2005) 
 
cAMP-specific 3',5'-cyclic phosphodiesterase 4B
Name:cAMP-specific 3',5'-cyclic phosphodiesterase 4B
Type:Protein
Mol. Mass.:83318.87
Organism:Homo sapiens (Human)
Description:Q07343
Residue:736
BDBM14366
BDBM10851
NameBDBM14366
Synonyms:3-(3-Cyclopentyloxy-4-methoxy-benzyl)-8-[1-(2-methoxy-benzyloxy)-1-methyl-ethyl]-3H-purine-6-ylamine V11294 Analogue 5b
TypeSmall organic molecule
Emp. Form.C29H35N5O4
Mol. Mass.517.6193
SMILESCOc1ccccc1COC(C)(C)c1nc2c(N)ncn(Cc3ccc(OC)c(OC4CCCC4)c3)c2n1