Reaction Details
TargetcAMP-specific 3',5'-cyclic phosphodiesterase 4D
LigandBDBM14381
Substrate/CompetitorBDBM10851
Meas. Tech.PDE Activity Assay
Ki 246±n/a nM
Citation Whitehead, JWLee, GPGharagozloo, PHofer, PGehrig, AWintergerst, PSmyth, DMcCoull, WHachicha, MPatel, AKyle, DJ 8-Substituted analogues of 3-(3-cyclopentyloxy-4-methoxy-benzyl)-8-isopropyladenine: highly potent and selective PDE4 inhibitors. J Med Chem48:1237-43 (2005) 
 
cAMP-specific 3',5'-cyclic phosphodiesterase 4D
Name:cAMP-specific 3',5'-cyclic phosphodiesterase 4D
Type:Protein
Mol. Mass.:91092.69
Organism:Homo sapiens (Human)
Description:Q08499
Residue:809
BDBM14381
BDBM10851
NameBDBM14381
Synonyms:4-{2-[6-Amino-3-(3-cyclopentyloxy-4-methoxy-benzyl)-3H-purin-8-yl]-2-methyl-propoxy}-benzoic Acid Methyl Ester | V11294 Analogue 5q
TypeSmall organic molecule
Emp. Form.C30H35N5O5
Mol. Mass.545.6294
SMILESCOC(=O)c1ccc(COC(C)(C)c2nc3c(N)ncn(Cc4ccc(OC)c(OC5CCCC5)c4)c3n2)cc1