Reaction Details
TargetcAMP-specific 3',5'-cyclic phosphodiesterase 4D
LigandBDBM14389
Substrate/CompetitorBDBM10851
Meas. Tech.PDE Activity Assay
Ki 4300±n/a nM
Citation Whitehead, JWLee, GPGharagozloo, PHofer, PGehrig, AWintergerst, PSmyth, DMcCoull, WHachicha, MPatel, AKyle, DJ 8-Substituted analogues of 3-(3-cyclopentyloxy-4-methoxy-benzyl)-8-isopropyladenine: highly potent and selective PDE4 inhibitors. J Med Chem48:1237-43 (2005) 
 
cAMP-specific 3',5'-cyclic phosphodiesterase 4D
Name:cAMP-specific 3',5'-cyclic phosphodiesterase 4D
Type:Protein
Mol. Mass.:91092.69
Organism:Homo sapiens (Human)
Description:Q08499
Residue:809
BDBM14389
BDBM10851
NameBDBM14389
Synonyms:3-(3-Cyclopentyloxy-4-methoxy-benzyl)-8-[1-(4-fluoro-benzyloxy)-ethyl]-3H-purin-6-ylamine V11294 Analogue 8c
TypeSmall organic molecule
Emp. Form.C27H30FN5O3
Mol. Mass.491.5572
SMILESCOc1ccc(Cn2cnc(N)c3nc(nc23)C(C)OCc2ccc(F)cc2)cc1OC1CCCC1