Reaction Details
TargetcAMP-specific 3',5'-cyclic phosphodiesterase 4D
LigandBDBM14376
Substrate/CompetitorBDBM10851
Meas. Tech.PDE Activity Assay
Ki 6.6±n/a nM
Citation Whitehead, JWLee, GPGharagozloo, PHofer, PGehrig, AWintergerst, PSmyth, DMcCoull, WHachicha, MPatel, AKyle, DJ 8-Substituted analogues of 3-(3-cyclopentyloxy-4-methoxy-benzyl)-8-isopropyladenine: highly potent and selective PDE4 inhibitors. J Med Chem48:1237-43 (2005) 
 
cAMP-specific 3',5'-cyclic phosphodiesterase 4D
Name:cAMP-specific 3',5'-cyclic phosphodiesterase 4D
Type:Protein
Mol. Mass.:91092.69
Organism:Homo sapiens (Human)
Description:Q08499
Residue:809
BDBM14376
BDBM10851
NameBDBM14376
Synonyms:3-(3-Cyclopentyloxy-4-methoxy-benzyl)-8-[1-(3,4-methylenedioxy-benzyloxy)-1-methyl-ethyl]-3Hpurin-6-ylamine V11294 Analogue 5l
TypeSmall organic molecule
Emp. Form.C29H33N5O5
Mol. Mass.531.6028
SMILESCOc1ccc(Cn2cnc(N)c3nc(nc23)C(C)(C)OCc2ccc3OCOc3c2)cc1OC1CCCC1