Reaction Details
TargetcAMP-specific 3',5'-cyclic phosphodiesterase 4D
LigandBDBM14372
Substrate/CompetitorBDBM10851
Meas. Tech.PDE Activity Assay
Ki 8.4±n/a nM
Citation Whitehead, JWLee, GPGharagozloo, PHofer, PGehrig, AWintergerst, PSmyth, DMcCoull, WHachicha, MPatel, AKyle, DJ 8-Substituted analogues of 3-(3-cyclopentyloxy-4-methoxy-benzyl)-8-isopropyladenine: highly potent and selective PDE4 inhibitors. J Med Chem48:1237-43 (2005) 
 
cAMP-specific 3',5'-cyclic phosphodiesterase 4D
Name:cAMP-specific 3',5'-cyclic phosphodiesterase 4D
Type:Protein
Mol. Mass.:91092.69
Organism:Homo sapiens (Human)
Description:Q08499
Residue:809
BDBM14372
BDBM10851
NameBDBM14372
Synonyms:3-(3-Cyclopentyloxy-4-methoxy-benzyl)-8-[1-(3-fluoro-benzyloxy)-1-methyl-ethyl]-3H-purin-6-ylamine V11294 Analogue 5h
TypeSmall organic molecule
Emp. Form.C28H32FN5O3
Mol. Mass.505.5838
SMILESCOc1ccc(Cn2cnc(N)c3nc(nc23)C(C)(C)OCc2cccc(F)c2)cc1OC1CCCC1