Reaction Details
TargetcAMP-specific 3',5'-cyclic phosphodiesterase 4D
LigandBDBM14375
Substrate/CompetitorBDBM10851
Meas. Tech.PDE Activity Assay
Ki 13.3±n/a nM
Citation Whitehead, JWLee, GPGharagozloo, PHofer, PGehrig, AWintergerst, PSmyth, DMcCoull, WHachicha, MPatel, AKyle, DJ 8-Substituted analogues of 3-(3-cyclopentyloxy-4-methoxy-benzyl)-8-isopropyladenine: highly potent and selective PDE4 inhibitors. J Med Chem48:1237-43 (2005) 
 
cAMP-specific 3',5'-cyclic phosphodiesterase 4D
Name:cAMP-specific 3',5'-cyclic phosphodiesterase 4D
Type:Protein
Mol. Mass.:91092.69
Organism:Homo sapiens (Human)
Description:Q08499
Residue:809
BDBM14375
BDBM10851
NameBDBM14375
Synonyms:(2E)-but-2-enedioic acid; 3-{[3-(cyclopentyloxy)-4-methoxyphenyl]methyl}-8-{2-[(3,4-difluorophenyl)methoxy]propan-2-yl}-3H-purin-6-amine V11294 Analogue 5k
TypeSmall organic molecule
Emp. Form.C28H31F2N5O3
Mol. Mass.523.5742
SMILESCOc1ccc(Cn2cnc(N)c3nc(nc23)C(C)(C)OCc2ccc(F)c(F)c2)cc1OC1CCCC1