Reaction Details
TargetPhosphatidylinositol 4,5-bisphosphate 3-kinase catalytic subunit gamma isoform
LigandBDBM339973
Substrate/Competitorn/a
Meas. Tech.Inhibition Assays
IC50 2000±n/a nM
Citation Kutok, JLWinkler, DGPalombella, VJCastro, ACEvans, CAJanardanannair, SLescarbeau, ALiu, TTremblay, MR Heterocyclic compounds and uses thereof US Patent US9775844 Publication Date 10/3/2017
 
Phosphatidylinositol 4,5-bisphosphate 3-kinase catalytic subunit gamma isoform
Name:Phosphatidylinositol 4,5-bisphosphate 3-kinase catalytic subunit gamma isoform
Type:Enzyme Subunit
Mol. Mass.:126470.30
Organism:Homo sapiens (Human)
Description:P48736
Residue:1102
BDBM339973
NameBDBM339973
Synonyms:US10329299, Compound 3 US9775844, Compound 3
TypeSmall organic molecule
Emp. Form.C30H28N6O2
Mol. Mass.504.5823
SMILESC[C@H](NC(=O)c1c(N)nn2cccnc12)c1cc2cccc(C#CC(C)(C)C)c2c(=O)n1-c1ccccc1