Reaction Details
TargetPhosphatidylinositol 4,5-bisphosphate 3-kinase catalytic subunit gamma isoform
LigandBDBM342552
Substrate/Competitorn/a
Meas. Tech.Inhibition Assays
IC50 2000±n/a nM
Citation Kutok, JLWinkler, DGPalombella, VJCastro, ACEvans, CAJanardanannair, SLescarbeau, ALiu, TTremblay, MR Heterocyclic compounds and uses thereof US Patent US9775844 Publication Date 10/3/2017
 
Phosphatidylinositol 4,5-bisphosphate 3-kinase catalytic subunit gamma isoform
Name:Phosphatidylinositol 4,5-bisphosphate 3-kinase catalytic subunit gamma isoform
Type:Enzyme Subunit
Mol. Mass.:126470.30
Organism:Homo sapiens (Human)
Description:P48736
Residue:1102
BDBM342552
NameBDBM342552
Synonyms:US10329299, Compound 103 US11541059, Compound 103 | US9775844, Compound 103
TypeSmall organic molecule
Emp. Form.C27H26N8O2
Mol. Mass.494.5477
SMILESCC(C)n1c(cc2cccc(C#Cc3cnn(C)c3)c2c1=O)[C@H](C)NC(=O)c1c(N)nn2cccnc12