Reaction Details
TargetPhosphatidylinositol 4,5-bisphosphate 3-kinase catalytic subunit gamma isoform
LigandBDBM342556
Substrate/Competitorn/a
Meas. Tech.Inhibition Assays
IC50 2000±n/a nM
Citation Kutok, JLWinkler, DGPalombella, VJCastro, ACEvans, CAJanardanannair, SLescarbeau, ALiu, TTremblay, MR Heterocyclic compounds and uses thereof US Patent US9775844 Publication Date 10/3/2017
 
Phosphatidylinositol 4,5-bisphosphate 3-kinase catalytic subunit gamma isoform
Name:Phosphatidylinositol 4,5-bisphosphate 3-kinase catalytic subunit gamma isoform
Type:Enzyme Subunit
Mol. Mass.:126470.30
Organism:Homo sapiens (Human)
Description:P48736
Residue:1102
BDBM342556
NameBDBM342556
Synonyms:US10329299, Compound 107 US11541059, Compound 107 | US9775844, Compound 107
TypeSmall organic molecule
Emp. Form.C29H22N8O2
Mol. Mass.514.5374
SMILESCn1cc(cn1)C#Cc1cccc2cc(CNC(=O)c3c(N)nn4cccnc34)n(-c3ccccc3)c(=O)c12