Reaction Details
TargetPhosphatidylinositol 4,5-bisphosphate 3-kinase catalytic subunit gamma isoform
LigandBDBM342557
Substrate/Competitorn/a
Meas. Tech.Inhibition Assays
IC50 2000±n/a nM
Citation Kutok, JLWinkler, DGPalombella, VJCastro, ACEvans, CAJanardanannair, SLescarbeau, ALiu, TTremblay, MR Heterocyclic compounds and uses thereof US Patent US9775844 Publication Date 10/3/2017
 
Phosphatidylinositol 4,5-bisphosphate 3-kinase catalytic subunit gamma isoform
Name:Phosphatidylinositol 4,5-bisphosphate 3-kinase catalytic subunit gamma isoform
Type:Enzyme Subunit
Mol. Mass.:126470.30
Organism:Homo sapiens (Human)
Description:P48736
Residue:1102
BDBM342557
NameBDBM342557
Synonyms:US10329299, Compound 108 US11541059, Compound 108 | US9775844, Compound 108
TypeSmall organic molecule
Emp. Form.C32H28N8O2
Mol. Mass.556.6171
SMILESC[C@H](NC(=O)c1c(N)nn2c(C)cc(C)nc12)c1cc2cccc(C#Cc3cnn(C)c3)c2c(=O)n1-c1ccccc1