Reaction Details
TargetPhosphatidylinositol 4,5-bisphosphate 3-kinase catalytic subunit beta isoform
LigandBDBM342558
Substrate/Competitorn/a
Meas. Tech.Inhibition Assays
IC50 2000±n/a nM
Citation Kutok, JLWinkler, DGPalombella, VJCastro, ACEvans, CAJanardanannair, SLescarbeau, ALiu, TTremblay, MR Heterocyclic compounds and uses thereof US Patent US9775844 Publication Date 10/3/2017
 
Phosphatidylinositol 4,5-bisphosphate 3-kinase catalytic subunit beta isoform
Name:Phosphatidylinositol 4,5-bisphosphate 3-kinase catalytic subunit beta isoform
Type:Enzyme Subunit
Mol. Mass.:122769.00
Organism:Homo sapiens (Human)
Description:P42338
Residue:1070
BDBM342558
NameBDBM342558
Synonyms:US10329299, Compound 109 US11541059, Compound 109 | US9775844, Compound 109
TypeSmall organic molecule
Emp. Form.C24H21N7O2
Mol. Mass.439.4692
SMILESC[C@H](NC(=O)c1c(N)nn2cccnc12)c1cc2cccc(N)c2c(=O)n1-c1ccccc1