Reaction Details
TargetPhosphatidylinositol 4,5-bisphosphate 3-kinase catalytic subunit beta isoform
LigandBDBM50192880
Substrate/Competitorn/a
Meas. Tech.Inhibition Assays
IC50 2000±n/a nM
Citation Kutok, JLWinkler, DGPalombella, VJCastro, ACEvans, CAJanardanannair, SLescarbeau, ALiu, TTremblay, MR Heterocyclic compounds and uses thereof US Patent US9775844 Publication Date 10/3/2017
 
Phosphatidylinositol 4,5-bisphosphate 3-kinase catalytic subunit beta isoform
Name:Phosphatidylinositol 4,5-bisphosphate 3-kinase catalytic subunit beta isoform
Type:Enzyme Subunit
Mol. Mass.:122769.00
Organism:Homo sapiens (Human)
Description:P42338
Residue:1070
BDBM50192880
NameBDBM50192880
Synonyms:CHEMBL3984425 US10675286, Compound 110 US9775844, Compound 4
TypeSmall organic molecule
Emp. Form.C30H24N8O2
Mol. Mass.528.564
SMILESC[C@H](NC(=O)c1c(N)nn2cccnc12)c1cc2cccc(C#Cc3cnn(C)c3)c2c(=O)n1-c1ccccc1