Reaction Details
TargetVascular endothelial growth factor receptor 2
LigandBDBM340025
Substrate/Competitorn/a
Meas. Tech.Inhibition Kinases In Vitro Assay
IC50 79.3±n/a nM
Citation Zdzalik, DLipner, JWieczorek, MDzwonek, KYamani, ADubiel, KLamparska-Przybysz, MGrygielewicz, PStanczak, A Pyrazolylbenzo[d]imidazole derivatives US Patent US9776988 Publication Date 10/3/2017
 
Vascular endothelial growth factor receptor 2
Name:Vascular endothelial growth factor receptor 2
Type:Receptor Tyrosine Kinase
Mol. Mass.:151510.97
Organism:Homo sapiens (Human)
Description:P35968
Residue:1356
BDBM340025
NameBDBM340025
Synonyms:US9776988, Example 8
TypeSmall organic molecule
Emp. Form.C26H30N6O3
Mol. Mass.474.5548
SMILESCOc1cc(CCc2cc(n[nH]2)-c2nc3cc(ccc3[nH]2)C(=O)N2CCN(C)CC2)cc(OC)c1