Reaction Details
TargetFibroblast growth factor receptor 1
LigandBDBM342456
Substrate/Competitorn/a
Meas. Tech.Inhibition Kinases In Vitro Assay
IC50 16.0±n/a nM
Citation Zdzalik, DLipner, JWieczorek, MDzwonek, KYamani, ADubiel, KLamparska-Przybysz, MGrygielewicz, PStanczak, A Pyrazolylbenzo[d]imidazole derivatives US Patent US9776988 Publication Date 10/3/2017
 
Fibroblast growth factor receptor 1
Name:Fibroblast growth factor receptor 1
Type:Receptor
Mol. Mass.:91861.70
Organism:Homo sapiens (Human)
Description:P11362
Residue:822
BDBM342456
NameBDBM342456
Synonyms:US9776988, Example 14
TypeSmall organic molecule
Emp. Form.C31H41N7O3
Mol. Mass.559.7023
SMILESCOc1cc(CCc2cc(n[nH]2)-c2nc3cc(CN4CCN(CCN5CCOCC5)CC4)ccc3[nH]2)cc(OC)c1