Reaction Details
TargetVascular endothelial growth factor receptor 2
LigandBDBM342461
Substrate/Competitorn/a
Meas. Tech.Inhibition Kinases In Vitro Assay
IC50 44.0±n/a nM
Citation Zdzalik, DLipner, JWieczorek, MDzwonek, KYamani, ADubiel, KLamparska-Przybysz, MGrygielewicz, PStanczak, A Pyrazolylbenzo[d]imidazole derivatives US Patent US9776988 Publication Date 10/3/2017
 
Vascular endothelial growth factor receptor 2
Name:Vascular endothelial growth factor receptor 2
Type:Receptor Tyrosine Kinase
Mol. Mass.:151510.97
Organism:Homo sapiens (Human)
Description:P35968
Residue:1356
BDBM342461
NameBDBM342461
Synonyms:US9776988, Example 21
TypeSmall organic molecule
Emp. Form.C29H35N7O4
Mol. Mass.545.6327
SMILESCOc1cc(CCc2cc(n[nH]2)-c2nc3ccc(cc3[nH]2)N2CCN(CC2)C(=O)N2CCOCC2)cc(OC)c1