Reaction Details
TargetFibroblast growth factor receptor 1
LigandBDBM342472
Substrate/Competitorn/a
Meas. Tech.Inhibition Kinases In Vitro Assay
IC50 11.3±n/a nM
Citation Zdzalik, DLipner, JWieczorek, MDzwonek, KYamani, ADubiel, KLamparska-Przybysz, MGrygielewicz, PStanczak, A Pyrazolylbenzo[d]imidazole derivatives US Patent US9776988 Publication Date 10/3/2017
 
Fibroblast growth factor receptor 1
Name:Fibroblast growth factor receptor 1
Type:Receptor
Mol. Mass.:91861.70
Organism:Homo sapiens (Human)
Description:P11362
Residue:822
BDBM342472
NameBDBM342472
Synonyms:US9776988, Example 4
TypeSmall organic molecule
Emp. Form.C27H32N6O4
Mol. Mass.504.5808
SMILESCOc1cc(CCc2cc(n[nH]2)-c2nc3ccc(cc3[nH]2)C(=O)NCCN2CCOCC2)cc(OC)c1