Reaction Details
TargetVascular endothelial growth factor receptor 2
LigandBDBM342472
Substrate/Competitorn/a
Meas. Tech.Inhibition Kinases In Vitro Assay
IC50 82.9±n/a nM
Citation Zdzalik, DLipner, JWieczorek, MDzwonek, KYamani, ADubiel, KLamparska-Przybysz, MGrygielewicz, PStanczak, A Pyrazolylbenzo[d]imidazole derivatives US Patent US9776988 Publication Date 10/3/2017
 
Vascular endothelial growth factor receptor 2
Name:Vascular endothelial growth factor receptor 2
Type:Receptor Tyrosine Kinase
Mol. Mass.:151510.97
Organism:Homo sapiens (Human)
Description:P35968
Residue:1356
BDBM342472
NameBDBM342472
Synonyms:US9776988, Example 4
TypeSmall organic molecule
Emp. Form.C27H32N6O4
Mol. Mass.504.5808
SMILESCOc1cc(CCc2cc(n[nH]2)-c2nc3ccc(cc3[nH]2)C(=O)NCCN2CCOCC2)cc(OC)c1