Reaction Details
TargetFibroblast growth factor receptor 2
LigandBDBM342487
Substrate/Competitorn/a
Meas. Tech.Inhibition Kinases In Vitro Assay
IC50 1.07±n/a nM
Citation Zdzalik, DLipner, JWieczorek, MDzwonek, KYamani, ADubiel, KLamparska-Przybysz, MGrygielewicz, PStanczak, A Pyrazolylbenzo[d]imidazole derivatives US Patent US9776988 Publication Date 10/3/2017
 
Fibroblast growth factor receptor 2
Name:Fibroblast growth factor receptor 2
Type:Enzyme
Mol. Mass.:92015.45
Organism:Homo sapiens (Human)
Description:P21802
Residue:821
BDBM342487
NameBDBM342487
Synonyms:US9776988, Example 3
TypeSmall organic molecule
Emp. Form.C26H29N5O4
Mol. Mass.475.5396
SMILESCOc1cc(CCc2cc(n[nH]2)-c2nc3ccc(cc3[nH]2)C(=O)NC2CCOCC2)cc(OC)c1