Reaction Details
TargetSodium channel protein type 9 subunit alpha
LigandBDBM342904
Substrate/Competitorn/a
Meas. Tech.In Vitro PX Assay
IC50 13.5±n/a nM
Citation Weiss, MDiMauro, EFDineen, TGraceffa, RGuzman-Perez, AHuang, HKreiman, CMarx, IENguyen, HNPeterson, EADeak, HL Bicyclic sulfonamide compounds as sodium channel inhibitors US Patent US9776995 Publication Date 10/3/2017
 
Sodium channel protein type 9 subunit alpha
Name:Sodium channel protein type 9 subunit alpha
Type:Protein
Mol. Mass.:226375.97
Organism:Homo sapiens (Human)
Description:Q15858
Residue:1988
BDBM342904
NameBDBM342904
Synonyms:1-(2-fluoro-5-methoxy-3'-(trifluoromethyl)-4-biphenylyl)-N-3-isoxazolyl-6-isoquinolinesulfonamide | US9776995, Example 115
TypeSmall organic molecule
Emp. Form.C26H17F4N3O4S
Mol. Mass.543.489
SMILESCOc1cc(c(F)cc1-c1nccc2cc(ccc12)S(=O)(=O)Nc1ccon1)-c1cccc(c1)C(F)(F)F